{"text_format":"1","workbook":"xlsx","n_sheets":4,"sheets":["Results","Members","Runners","Categories"],"not_rendered":{"charts":0,"images":0,"macros":1,"external_links":0,"defined_names":2,"comments":0,"pivot_tables":0},"unopened":[],"bounds":{"document_bytes":16777216,"sheet_cells":100000,"rows_first":2000,"rows_last":500,"rows_between":2000,"halvings":0,"cell_chars":16384,"cell_head_chars":4096},"cells_cut":0,"cells_raw":0,"read":"whole","date_system":"1900"}

{"sheet":"Results","index":0,"n_rows":14,"n_cols":12,"rows_kept":14,"cut":false,"hidden":false,"merged":[]}
[]
[]
[]
[null,null,"Club","Score","Runners","Scoring Vets","Scoring 2nd Claim",null,null,null,"Rules"]
[null,null,"BS",{"$f":"SUM(Runners!$Q$3:$Q$10)","v":119},18,{"$f":" COUNTIF(Runners!O2:O8, \"V*\")","v":6},{"$f":" COUNTIF(Runners!$P$3:$P$8, 2)","v":0},null,null,null,"Number of Scoring Runners",8]
[null,null,"HRC",{"$f":"SUM(Runners!$W$3:$W$10)","v":264},23,{"$f":" COUNTIF(Runners!U2:U8, \"V*\")","v":4},{"$f":" COUNTIF(Runners!$V$3:$V$8, 2)","v":0},null,null,null,"Number of Veterans",2]
[null,null,"SS",{"$f":"SUM(Runners!$AC$3:$AC$10)","v":98},28,{"$f":" COUNTIF(Runners!AA2:AA8, \"V*\")","v":4},{"$f":" COUNTIF(Runners!$AB$3:$AB$8, 2)","v":0},null,null,null,"Number of 2nd Claim Scorers",2]
[null,null,"WJ",{"$f":"SUM(Runners!$K$3:$K$10)","v":112},41,{"$f":" COUNTIF(Runners!I2:I8, \"V*\")","v":5},{"$f":"COUNTIF(Runners!$J$3:$J$8,2)","v":0}]
[]
[]
[]
[]
[]
[null,null,"Maximum Score",120]

{"sheet":"Members","index":1,"n_rows":111,"n_cols":12,"rows_kept":111,"cut":false,"hidden":false,"merged":[]}
["Name","Club","Age Category","Claim","Finish Position",null,null,"Senior","V35","V45","V55","V65"]
["Fiona Halls","SS","V45",1,1,null,null,null,null,1]
["Fliss Tournant","SS","S",1,2,null,null,1]
["Harriet Keeley","WJ","S",1,3,null,null,2]
["Lindsey Russell-Smith","WJ","V35",1,4,null,null,null,1]
["Kelly Rowland","BS","V35",1,5,null,null,null,2]
["Caroline Thompson","SS","V35",1,6,null,null,null,3]
["Jo Arscott","BS","V35",1,7,null,null,null,4]
["Corrine Jay","HRC","V45",1,8,null,null,null,null,2]
["Hannah McIlvenna","BS","V45",1,9,null,null,null,null,3]
["Lisa Roberts","WJ","V45",1,10,null,null,null,null,4]
["Bev McLees","WJ","V45",1,11,null,null,null,null,5]
["Vicky Simpson","BS","V45",1,12,null,null,null,null,6]
["Zib Gotto","SS","V45",1,13,null,null,null,null,7]
["Kerri Spavin","WJ","V35",1,14,null,null,null,5]
["Janet Lipski","SS","V45",1,15,null,null,null,null,8]
["Siobhan Dockerill","SS","S",1,16,null,null,3]
["Jo Jurd","BS","V35",1,17,null,null,null,6]
["Emma Mulley","WJ","V35",1,18,null,null,null,7]
["Julie Witchalls","BS","V45",1,19,null,null,null,null,9]
["Catherine Ridge","HRC","V35",1,20,null,null,null,8]
["Sandi Rust","HRC","V45",1,21,null,null,null,null,10]
["Eleanor Tew","SS","S",1,22,null,null,4]
["Kate Holden","SS","V45",1,23,null,null,null,null,11]
["Clare Masterson","BS","V35",1,24,null,null,null,9]
["Annie Reville","WJ","V35",1,25,null,null,null,10]
["Jenny Latham","BS","V35",1,26,null,null,null,11]
["Anthea Francis","WJ","V35",1,27,null,null,null,12]
["Denise Allsopp","BS","S",1,28,null,null,5]
["Emily Mayers","WJ","V35",1,29,null,null,null,13]
["Emma Nixon","BS","V55",1,30,null,null,null,null,null,1]
["Lorraine Oakley","WJ","V35",1,31,null,null,null,14]
["Kerri Rooke","WJ","S",1,32,null,null,null,null,12]
["Janet Reddit","WJ","V45",1,33,null,null,null,null,null,2]
["Debs Aires","WJ","V45",1,34,null,null,null,null,13]
["Bekah Cranch","BS","S",1,35,null,null,6]
["Sharon Threllfall","WJ","V35",1,36,null,null,null,15]
["Ness Bull","HRC","S",1,37,null,null,7]
["Anne Ramsden","WJ","V65",1,38,null,null,null,null,null,null,1]
["June Brennan","SS","V55",1,39]
["Elizabeth Warrington","BS","S",1,40,null,null,8]
["Louise Kedge","HRC","S",1,41,null,null,9]
["Marianne Mitchell","WJ","V35",1,42,null,null,null,16]
["Kerry Maveris","HRC","V45",1,43,null,null,null,null,14]
["Kirsty Jenkins","WJ","S",1,44,null,null,10]
["Tina Hamilton","SS","V45",1,45,null,null,null,null,15]
["Gail Nicholls","HRC","V45",1,46,null,null,null,null,16]
["Gemma Charvill","WJ","V35",1,47,null,null,null,17]
["Wendy Schroder","HRC","V45",1,48,null,null,null,null,17]
["Pam Wilson","WJ","V55",1,49,null,null,null,null,null,3]
["Louise Cootes","HRC","V35",1,50,null,null,null,18]
["Michelle Cross","WJ","V45",1,51,null,null,null,null,18]
["Janice Page","HRC","V55",1,52,null,null,null,null,null,4]
["Kate Hipkins","WJ","V45",1,53,null,null,null,null,19]
["Bridget Savill","SS","V45",1,54,null,null,null,null,20]
["Debbie Barry","HRC","V55",1,55,null,null,null,null,null,5]
["Teresa Weedon","WJ","V55",1,56,null,null,null,null,null,6]
["Mel Blackaby","WJ","V45",1,57,null,null,null,null,21]
["Margit W-James","SS","V55",1,58,null,null,null,null,null,7]
["Helen Graves","SS","S",2,59,null,null,11]
["Chloe Brown","SS","V55",1,60,null,null,null,null,null,8]
["Jenny Burke","BS","S",1,61,null,null,12]
["Lisa Plumb","SS","V45",1,62,null,null,null,null,22]
["Debbie Smith","HRC","V45",1,63,null,null,null,null,23]
["A Warrington","BS","V45",1,64,null,null,null,null,24]
["Lorraine Melton","SS","V45",1,65,null,null,null,null,25]
["Kate Pitts","BS","V35",1,66,null,null,null,19]
["Olu Gooden","SS","V55",1,67,null,null,null,null,null,9]
["Karen Moir","HRC","V55",1,68,null,null,null,null,null,10]
["Sandra Webber","HRC","V35",1,69,null,null,null,20]
["Tracy Brennan","WJ","V45",1,70,null,null,null,null,26]
["Judith Stiletto","WJ","V55",1,71,null,null,null,null,null,11]
["Jane Evans","HRC","V45",1,72,null,null,null,null,27]
["Sue Taylor","WJ","V35",1,73,null,null,null,21]
["Marie Hockley","BS","V55",1,74,null,null,null,null,null,12]
["Gina Holley","SS","V45",1,75,null,null,null,null,28]
["Louise Peacock","HRC","V45",1,76,null,null,null,null,29]
["Liz Roberts","HRC","S",1,77,null,null,13]
["Sue Last","BS","V55",1,78,null,null,null,null,null,13]
["Helen Hewlett","SS","V55",1,79,null,null,null,null,null,14]
["Teresa Strickland","HRC","V45",1,80,null,null,null,null,30]
["Anne Garnish","WJ","V45",1,81,null,null,null,null,31]
["Siobhan Gibson","SS","V45",1,82,null,null,null,null,32]
["Wendy Reddaway","WJ","V55",1,83,null,null,null,null,null,15]
["Aona Alder","WJ","V55",1,84,null,null,null,null,null,16]
["Cosette Ackland","WJ","V45",1,85,null,null,null,null,33]
["Jackie Barnard","WJ","V55",1,86,null,null,null,null,null,17]
["Brenda Clayton","HRC","V65",1,87,null,null,null,null,null,null,2]
["Jaqui Lucas","SS","V55",1,88,null,null,null,null,null,18]
["Mags Waddington","WJ","V65",1,89,null,null,null,null,null,null,3]
["Linda Brett","SS","V55",1,90,null,null,null,null,null,19]
["Terri Bell","WJ","V35",1,91,null,null,null,22]
["Melanie King","WJ","V45",1,92,null,null,null,null,34]
["Joy Hale","HRC","V35",1,93,null,null,null,23]
["Alli Bull","HRC","V45",1,94,null,null,null,null,35]
["Mel Hallam","SS","V35",1,95,null,null,null,24]
["Claron Riviere","WJ","V55",1,96,null,null,null,null,null,20]
["Anna Kotowska","SS","S",1,97,null,null,14]
["Lindsey Pearson","HRC","V35",1,98,null,null,null,25]
["Julie Bradley","HRC","V55",1,99,null,null,null,null,null,21]
["Vi Rowe","WJ","V65",1,100,null,null,null,null,null,null,4]
["Carolyn Thackstone","SS","V45",1,101,null,null,null,null,36]
["Kirsty Reid","BS","S",1,102,null,null,15]
["Maureen Hurt","WJ","V55",1,103,null,null,null,null,null,22]
["Catherine Gill","SS","V45",1,104,null,null,null,null,37]
["Kathy Tunstell","WJ","V35",1,105,null,null,null,26]
["Mags Balfour","WJ","V65",1,106,null,null,null,null,null,null,5]
["Liz Lord","WJ","V65",1,107,null,null,null,null,null,null,6]
["Liz watson","WJ","V65",1,108,null,null,null,null,null,null,7]
["Anne Walker","SS","V45",1,109,null,null,null,null,38]
["Valerie Foreman","SS","V35",1,110,null,null,null,27]

{"sheet":"Runners","index":2,"n_rows":112,"n_cols":29,"rows_kept":112,"cut":false,"hidden":false,"merged":[]}
["Name","Club","Age Category","Claim","Position",null,"Ware Joggers",null,null,null,null,null,"Bishop's Stortford",null,null,null,null,null,"Harlow",null,null,null,null,null,"Saffron Striders"]
["Fiona Halls","SS","V45",1,1,null,"Name","Club","Age Category","Claim","Position",null,"Name","Club","Age Category","Claim","Position",null,"Name","Club","Age Category","Claim","Position",null,"Name","Club","Age Category","Claim","Position"]
["Fiona Halls","SS","V45",1,1,null,"Harriet Keeley","WJ","S",1,3,null,"Kelly Rowland","BS","V35",1,5,null,"Corrine Jay","HRC","V45",1,8,null,"Fiona Halls","SS","V45",1,1]
["Fliss Tournant","SS","S",1,2,null,"Lindsey Russell-Smith","WJ","V35",1,4,null,"Jo Arscott","BS","V35",1,7,null,"Catherine Ridge","HRC","V35",1,20,null,"Fliss Tournant","SS","S",1,2]
["Harriet Keeley","WJ","S",1,3,null,"Lisa Roberts","WJ","V45",1,10,null,"Hannah McIlvenna","BS","V45",1,9,null,"Sandi Rust","HRC","V45",1,21,null,"Caroline Thompson","SS","V35",1,6]
["Lindsey Russell-Smith","WJ","V35",1,4,null,"Bev McLees","WJ","V45",1,11,null,"Vicky Simpson","BS","V45",1,12,null,"Ness Bull","HRC","S",1,37,null,"Zib Gotto","SS","V45",1,13]
["Kelly Rowland","BS","V35",1,5,null,"Kerri Spavin","WJ","V35",1,14,null,"Jo Jurd","BS","V35",1,17,null,"Louise Kedge","HRC","S",1,41,null,"Janet Lipski","SS","V45",1,15]
["Caroline Thompson","SS","V35",1,6,null,"Emma Mulley","WJ","V35",1,18,null,"Julie Witchalls","BS","V45",1,19,null,"Kerry Maveris","HRC","V45",1,43,null,"Siobhan Dockerill","SS","S",1,16]
["Jo Arscott","BS","V35",1,7,null,"Annie Reville","WJ","V35",1,25,null,"Clare Masterson","BS","V35",1,24,null,"Gail Nicholls","HRC","V45",1,46,null,"Eleanor Tew","SS","S",1,22]
["Corrine Jay","HRC","V45",1,8,null,"Anthea Francis","WJ","V35",1,27,null,"Jenny Latham","BS","V35",1,26,null,"Wendy Schroder","HRC","V45",1,48,null,"Kate Holden","SS","V45",1,23]
["Hannah McIlvenna","BS","V45",1,9,null,"Emily Mayers","WJ","V35",1,29,null,"Denise Allsopp","BS","S",1,28,null,"Louise Cootes","HRC","V35",1,50,null,"June Brennan","SS","V55",1,39]
["Lisa Roberts","WJ","V45",1,10,null,"Lorraine Oakley","WJ","V35",1,31,null,"Emma Nixon","BS","V55",1,30,null,"Janice Page","HRC","V55",1,52,null,"Tina Hamilton","SS","V45",1,45]
["Bev McLees","WJ","V45",1,11,null,"Kerri Rooke","WJ","S",1,32,null,"Bekah Cranch","BS","S",1,35,null,"Debbie Barry","HRC","V55",1,55,null,"Bridget Savill","SS","V45",1,54]
["Vicky Simpson","BS","V45",1,12,null,"Janet Reddit","WJ","V45",1,33,null,"Elizabeth Warrington","BS","S",1,40,null,"Debbie Smith","HRC","V45",1,63,null,"Margit W-James","SS","V55",1,58]
["Zib Gotto","SS","V45",1,13,null,"Debs Aires","WJ","V45",1,34,null,"Jenny Burke","BS","S",1,61,null,"Karen Moir","HRC","V55",1,68,null,"Helen Graves","SS","S",2,59]
["Kerri Spavin","WJ","V35",1,14,null,"Sharon Threllfall","WJ","V35",1,36,null,"A Warrington","BS","V45",1,64,null,"Sandra Webber","HRC","V35",1,69,null,"Chloe Brown","SS","V55",1,60]
["Janet Lipski","SS","V45",1,15,null,"Anne Ramsden","WJ","V65",1,38,null,"Kate Pitts","BS","V35",1,66,null,"Jane Evans","HRC","V45",1,72,null,"Lisa Plumb","SS","V45",1,62]
["Siobhan Dockerill","SS","S",1,16,null,"Marianne Mitchell","WJ","V35",1,42,null,"Marie Hockley","BS","V55",1,74,null,"Louise Peacock","HRC","V45",1,76,null,"Lorraine Melton","SS","V45",1,65]
["Jo Jurd","BS","V35",1,17,null,"Kirsty Jenkins","WJ","S",1,44,null,"Sue Last","BS","V55",1,78,null,"Liz Roberts","HRC","S",1,77,null,"Olu Gooden","SS","V55",1,67]
["Emma Mulley","WJ","V35",1,18,null,"Gemma Charvill","WJ","V35",1,47,null,"Kirsty Reid","BS","S",1,102,null,"Teresa Strickland","HRC","V45",1,80,null,"Gina Holley","SS","V45",1,75]
["Julie Witchalls","BS","V45",1,19,null,"Pam Wilson","WJ","V55",1,49,null,null,null,null,null,null,null,"Brenda Clayton","HRC","V65",1,87,null,"Helen Hewlett","SS","V55",1,79]
["Catherine Ridge","HRC","V35",1,20,null,"Michelle Cross","WJ","V45",1,51,null,null,null,null,null,null,null,"Joy Hale","HRC","V35",1,93,null,"Siobhan Gibson","SS","V45",1,82]
["Sandi Rust","HRC","V45",1,21,null,"Kate Hipkins","WJ","V45",1,53,null,null,null,null,null,null,null,"Alli Bull","HRC","V45",1,94,null,"Jaqui Lucas","SS","V55",1,88]
["Eleanor Tew","SS","S",1,22,null,"Teresa Weedon","WJ","V55",1,56,null,null,null,null,null,null,null,"Lindsey Pearson","HRC","V35",1,98,null,"Linda Brett","SS","V55",1,90]
["Kate Holden","SS","V45",1,23,null,"Mel Blackaby","WJ","V45",1,57,null,null,null,null,null,null,null,"Julie Bradley","HRC","V55",1,99,null,"Mel Hallam","SS","V35",1,95]
["Clare Masterson","BS","V35",1,24,null,"Tracy Brennan","WJ","V45",1,70,null,null,null,null,null,null,null,null,null,null,null,null,null,"Anna Kotowska","SS","S",1,97]
["Annie Reville","WJ","V35",1,25,null,"Judith Stiletto","WJ","V55",1,71,null,null,null,null,null,null,null,null,null,null,null,null,null,"Carolyn Thackstone","SS","V45",1,101]
["Jenny Latham","BS","V35",1,26,null,"Sue Taylor","WJ","V35",1,73,null,null,null,null,null,null,null,null,null,null,null,null,null,"Catherine Gill","SS","V45",1,104]
["Anthea Francis","WJ","V35",1,27,null,"Anne Garnish","WJ","V45",1,81,null,null,null,null,null,null,null,null,null,null,null,null,null,"Anne Walker","SS","V45",1,109]
["Denise Allsopp","BS","S",1,28,null,"Wendy Reddaway","WJ","V55",1,83,null,null,null,null,null,null,null,null,null,null,null,null,null,"Valerie Foreman","SS","V35",1,110]
["Emily Mayers","WJ","V35",1,29,null,"Aona Alder","WJ","V55",1,84]
["Emma Nixon","BS","V55",1,30,null,"Cosette Ackland","WJ","V45",1,85]
["Lorraine Oakley","WJ","V35",1,31,null,"Jackie Barnard","WJ","V55",1,86]
["Kerri Rooke","WJ","S",1,32,null,"Mags Waddington","WJ","V65",1,89]
["Janet Reddit","WJ","V45",1,33,null,"Terri Bell","WJ","V35",1,91]
["Debs Aires","WJ","V45",1,34,null,"Melanie King","WJ","V45",1,92]
["Bekah Cranch","BS","S",1,35,null,"Claron Riviere","WJ","V55",1,96]
["Sharon Threllfall","WJ","V35",1,36,null,"Vi Rowe","WJ","V65",1,100]
["Ness Bull","HRC","S",1,37,null,"Maureen Hurt","WJ","V55",1,103]
["Anne Ramsden","WJ","V65",1,38,null,"Kathy Tunstell","WJ","V35",1,105]
["June Brennan","SS","V55",1,39,null,"Mags Balfour","WJ","V65",1,106]
["Elizabeth Warrington","BS","S",1,40,null,"Liz Lord","WJ","V65",1,107]
["Louise Kedge","HRC","S",1,41,null,"Liz watson","WJ","V65",1,108]
["Marianne Mitchell","WJ","V35",1,42]
["Kerry Maveris","HRC","V45",1,43]
["Kirsty Jenkins","WJ","S",1,44]
["Tina Hamilton","SS","V45",1,45]
["Gail Nicholls","HRC","V45",1,46]
["Gemma Charvill","WJ","V35",1,47]
["Wendy Schroder","HRC","V45",1,48]
["Pam Wilson","WJ","V55",1,49]
["Louise Cootes","HRC","V35",1,50]
["Michelle Cross","WJ","V45",1,51]
["Janice Page","HRC","V55",1,52]
["Kate Hipkins","WJ","V45",1,53]
["Bridget Savill","SS","V45",1,54]
["Debbie Barry","HRC","V55",1,55]
["Teresa Weedon","WJ","V55",1,56]
["Mel Blackaby","WJ","V45",1,57]
["Margit W-James","SS","V55",1,58]
["Helen Graves","SS","S",2,59]
["Chloe Brown","SS","V55",1,60]
["Jenny Burke","BS","S",1,61]
["Lisa Plumb","SS","V45",1,62]
["Debbie Smith","HRC","V45",1,63]
["A Warrington","BS","V45",1,64]
["Lorraine Melton","SS","V45",1,65]
["Kate Pitts","BS","V35",1,66]
["Olu Gooden","SS","V55",1,67]
["Karen Moir","HRC","V55",1,68]
["Sandra Webber","HRC","V35",1,69]
["Tracy Brennan","WJ","V45",1,70]
["Judith Stiletto","WJ","V55",1,71]
["Jane Evans","HRC","V45",1,72]
["Sue Taylor","WJ","V35",1,73]
["Marie Hockley","BS","V55",1,74]
["Gina Holley","SS","V45",1,75]
["Louise Peacock","HRC","V45",1,76]
["Liz Roberts","HRC","S",1,77]
["Sue Last","BS","V55",1,78]
["Helen Hewlett","SS","V55",1,79]
["Teresa Strickland","HRC","V45",1,80]
["Anne Garnish","WJ","V45",1,81]
["Siobhan Gibson","SS","V45",1,82]
["Wendy Reddaway","WJ","V55",1,83]
["Aona Alder","WJ","V55",1,84]
["Cosette Ackland","WJ","V45",1,85]
["Jackie Barnard","WJ","V55",1,86]
["Brenda Clayton","HRC","V65",1,87]
["Jaqui Lucas","SS","V55",1,88]
["Mags Waddington","WJ","V65",1,89]
["Linda Brett","SS","V55",1,90]
["Terri Bell","WJ","V35",1,91]
["Melanie King","WJ","V45",1,92]
["Joy Hale","HRC","V35",1,93]
["Alli Bull","HRC","V45",1,94]
["Mel Hallam","SS","V35",1,95]
["Claron Riviere","WJ","V55",1,96]
["Anna Kotowska","SS","S",1,97]
["Lindsey Pearson","HRC","V35",1,98]
["Julie Bradley","HRC","V55",1,99]
["Vi Rowe","WJ","V65",1,100]
["Carolyn Thackstone","SS","V45",1,101]
["Kirsty Reid","BS","S",1,102]
["Maureen Hurt","WJ","V55",1,103]
["Catherine Gill","SS","V45",1,104]
["Kathy Tunstell","WJ","V35",1,105]
["Mags Balfour","WJ","V65",1,106]
["Liz Lord","WJ","V65",1,107]
["Liz watson","WJ","V65",1,108]
["Anne Walker","SS","V45",1,109]
["Valerie Foreman","SS","V35",1,110]

{"sheet":"Categories","index":3,"n_rows":41,"n_cols":34,"rows_kept":41,"cut":false,"hidden":false,"merged":[]}
["Senior",null,null,null,null,null,null,"Vet 35",null,null,null,null,null,null,"Vet 45",null,null,null,null,null,null,"Vet 55",null,null,null,null,null,null,"Vet 65"]
["Name","Club","Age Category","Claim","Overall Position","Category Position",null,"Name","Club","Age Category","Claim","Overall Position","Category Position",null,"Name","Club","Age Category","Claim","Overall Position","Category Position",null,"Name","Club","Age Category","Claim","Overall Position","Category Position",null,"Name","Club","Age Category","Claim","Overall Position","Category Position"]
["Fliss Tournant","SS","S",1,2,1,null,"Lindsey Russell-Smith","WJ","V35",1,4,1,null,"Fiona Halls","SS","V45",1,1,1,null,"Emma Nixon","BS","V55",1,30,1,null,"Anne Ramsden","WJ","V65",1,38,1]
["Harriet Keeley","WJ","S",1,3,2,null,"Kelly Rowland","BS","V35",1,5,2,null,"Fiona Halls","SS","V45",1,1,2,null,"June Brennan","SS","V55",1,39,2,null,"Brenda Clayton","HRC","V65",1,87,2]
["Siobhan Dockerill","SS","S",1,16,3,null,"Caroline Thompson","SS","V35",1,6,3,null,"Corrine Jay","HRC","V45",1,8,3,null,"Pam Wilson","WJ","V55",1,49,3,null,"Mags Waddington","WJ","V65",1,89,3]
["Eleanor Tew","SS","S",1,22,4,null,"Jo Arscott","BS","V35",1,7,4,null,"Hannah McIlvenna","BS","V45",1,9,4,null,"Janice Page","HRC","V55",1,52,4,null,"Vi Rowe","WJ","V65",1,100,4]
["Denise Allsopp","BS","S",1,28,5,null,"Kerri Spavin","WJ","V35",1,14,5,null,"Lisa Roberts","WJ","V45",1,10,5,null,"Debbie Barry","HRC","V55",1,55,5,null,"Mags Balfour","WJ","V65",1,106,5]
["Kerri Rooke","WJ","S",1,32,6,null,"Jo Jurd","BS","V35",1,17,6,null,"Bev McLees","WJ","V45",1,11,6,null,"Teresa Weedon","WJ","V55",1,56,6,null,"Liz Lord","WJ","V65",1,107,6]
["Bekah Cranch","BS","S",1,35,7,null,"Emma Mulley","WJ","V35",1,18,7,null,"Vicky Simpson","BS","V45",1,12,7,null,"Margit W-James","SS","V55",1,58,7,null,"Liz watson","WJ","V65",1,108,7]
["Ness Bull","HRC","S",1,37,8,null,"Catherine Ridge","HRC","V35",1,20,8,null,"Zib Gotto","SS","V45",1,13,8,null,"Chloe Brown","SS","V55",1,60,8]
["Elizabeth Warrington","BS","S",1,40,9,null,"Clare Masterson","BS","V35",1,24,9,null,"Janet Lipski","SS","V45",1,15,9,null,"Olu Gooden","SS","V55",1,67,9]
["Louise Kedge","HRC","S",1,41,10,null,"Annie Reville","WJ","V35",1,25,10,null,"Julie Witchalls","BS","V45",1,19,10,null,"Karen Moir","HRC","V55",1,68,10]
["Kirsty Jenkins","WJ","S",1,44,11,null,"Jenny Latham","BS","V35",1,26,11,null,"Sandi Rust","HRC","V45",1,21,11,null,"Judith Stiletto","WJ","V55",1,71,11]
["Helen Graves","SS","S",2,59,12,null,"Anthea Francis","WJ","V35",1,27,12,null,"Kate Holden","SS","V45",1,23,12,null,"Marie Hockley","BS","V55",1,74,12]
["Jenny Burke","BS","S",1,61,13,null,"Emily Mayers","WJ","V35",1,29,13,null,"Janet Reddit","WJ","V45",1,33,13,null,"Sue Last","BS","V55",1,78,13]
["Liz Roberts","HRC","S",1,77,14,null,"Lorraine Oakley","WJ","V35",1,31,14,null,"Debs Aires","WJ","V45",1,34,14,null,"Helen Hewlett","SS","V55",1,79,14]
["Anna Kotowska","SS","S",1,97,15,null,"Sharon Threllfall","WJ","V35",1,36,15,null,"Kerry Maveris","HRC","V45",1,43,15,null,"Wendy Reddaway","WJ","V55",1,83,15]
["Kirsty Reid","BS","S",1,102,16,null,"Marianne Mitchell","WJ","V35",1,42,16,null,"Tina Hamilton","SS","V45",1,45,16,null,"Aona Alder","WJ","V55",1,84,16]
[null,null,null,null,null,null,null,"Gemma Charvill","WJ","V35",1,47,17,null,"Gail Nicholls","HRC","V45",1,46,17,null,"Jackie Barnard","WJ","V55",1,86,17]
[null,null,null,null,null,null,null,"Louise Cootes","HRC","V35",1,50,18,null,"Wendy Schroder","HRC","V45",1,48,18,null,"Jaqui Lucas","SS","V55",1,88,18]
[null,null,null,null,null,null,null,"Kate Pitts","BS","V35",1,66,19,null,"Michelle Cross","WJ","V45",1,51,19,null,"Linda Brett","SS","V55",1,90,19]
[null,null,null,null,null,null,null,"Sandra Webber","HRC","V35",1,69,20,null,"Kate Hipkins","WJ","V45",1,53,20,null,"Claron Riviere","WJ","V55",1,96,20]
[null,null,null,null,null,null,null,"Sue Taylor","WJ","V35",1,73,21,null,"Bridget Savill","SS","V45",1,54,21,null,"Julie Bradley","HRC","V55",1,99,21]
[null,null,null,null,null,null,null,"Terri Bell","WJ","V35",1,91,22,null,"Mel Blackaby","WJ","V45",1,57,22,null,"Maureen Hurt","WJ","V55",1,103,22]
[null,null,null,null,null,null,null,"Joy Hale","HRC","V35",1,93,23,null,"Lisa Plumb","SS","V45",1,62,23]
[null,null,null,null,null,null,null,"Mel Hallam","SS","V35",1,95,24,null,"Debbie Smith","HRC","V45",1,63,24]
[null,null,null,null,null,null,null,"Lindsey Pearson","HRC","V35",1,98,25,null,"A Warrington","BS","V45",1,64,25]
[null,null,null,null,null,null,null,"Kathy Tunstell","WJ","V35",1,105,26,null,"Lorraine Melton","SS","V45",1,65,26]
[null,null,null,null,null,null,null,"Valerie Foreman","SS","V35",1,110,27,null,"Tracy Brennan","WJ","V45",1,70,27]
[null,null,null,null,null,null,null,null,null,null,null,null,null,null,"Jane Evans","HRC","V45",1,72,28]
[null,null,null,null,null,null,null,null,null,null,null,null,null,null,"Gina Holley","SS","V45",1,75,29]
[null,null,null,null,null,null,null,null,null,null,null,null,null,null,"Louise Peacock","HRC","V45",1,76,30]
[null,null,null,null,null,null,null,null,null,null,null,null,null,null,"Teresa Strickland","HRC","V45",1,80,31]
[null,null,null,null,null,null,null,null,null,null,null,null,null,null,"Anne Garnish","WJ","V45",1,81,32]
[null,null,null,null,null,null,null,null,null,null,null,null,null,null,"Siobhan Gibson","SS","V45",1,82,33]
[null,null,null,null,null,null,null,null,null,null,null,null,null,null,"Cosette Ackland","WJ","V45",1,85,34]
[null,null,null,null,null,null,null,null,null,null,null,null,null,null,"Melanie King","WJ","V45",1,92,35]
[null,null,null,null,null,null,null,null,null,null,null,null,null,null,"Alli Bull","HRC","V45",1,94,36]
[null,null,null,null,null,null,null,null,null,null,null,null,null,null,"Carolyn Thackstone","SS","V45",1,101,37]
[null,null,null,null,null,null,null,null,null,null,null,null,null,null,"Catherine Gill","SS","V45",1,104,38]
[null,null,null,null,null,null,null,null,null,null,null,null,null,null,"Anne Walker","SS","V45",1,109,39]