{"text_format":"1","workbook":"xlsx","n_sheets":4,"sheets":["Results","Members","Runners","Categories"],"not_rendered":{"charts":0,"images":0,"macros":1,"external_links":0,"defined_names":2,"comments":0,"pivot_tables":0},"unopened":[],"bounds":{"document_bytes":16777216,"sheet_cells":100000,"rows_first":2000,"rows_last":500,"rows_between":2000,"halvings":0,"cell_chars":16384,"cell_head_chars":4096},"cells_cut":0,"cells_raw":0,"read":"whole","date_system":"1900"}

{"sheet":"Results","index":0,"n_rows":14,"n_cols":12,"rows_kept":14,"cut":false,"hidden":false,"merged":[]}
[]
[]
[]
[null,null,"Club","Score","Runners","Scoring Vets","Scoring 2nd Claim",null,null,null,"Rules"]
[null,null,"BS",{"$f":"SUM(Runners!$Q$3:$Q$10)","v":99},30,{"$f":" COUNTIF(Runners!O2:O12, \"V*\")","v":4},{"$f":" COUNTIF(Runners!P3:P12, 2)","v":0},null,null,null,"Number of Scoring Runners",8]
[null,null,"HRC",{"$f":"SUM(Runners!$W$3:$W$10)","v":248},25,{"$f":" COUNTIF(Runners!U2:U12, \"V*\")","v":6},{"$f":" COUNTIF(Runners!V3:V12, 2)","v":0},null,null,null,"Number of Veterans",2]
[null,null,"SS",{"$f":"SUM(Runners!$AC$3:$AC$10)","v":159},34,{"$f":" COUNTIF(Runners!AA2:AA12, \"V*\")","v":6},{"$f":" COUNTIF(Runners!$AB$3:$AB$12, 2)","v":3},null,null,null,"Number of 2nd Claim Scorers",2]
[null,null,"WJ",{"$f":"SUM(Runners!$K$3:$K$10)","v":85},33,{"$f":" COUNTIF(Runners!I2:I12, \"V*\")","v":5},{"$f":" COUNTIF(Runners!$J$3:$J$12, 2)","v":0}]
[]
[]
[]
[]
[]
[null,null,"Maximum Score",133]

{"sheet":"Members","index":1,"n_rows":124,"n_cols":13,"rows_kept":124,"cut":false,"hidden":false,"merged":[]}
["Name","Club","Age Category","Claim","Finish Position",null,null,null,"Senior","V40","V50","V60","V70"]
["Michael Waddington","WJ","S",1,1,null,null,null,1]
["Andy Mynott","SS","V40",1,2,null,null,null,null,1]
["Oscar Bell","WJ","S",1,3,null,null,null,2]
["Kevin Francis","WJ","V40",1,4,null,null,null,null,2]
["James Bosher","BS","S",1,5,null,null,null,3]
["Vincent Riviere","WJ","V40",1,6,null,null,null,null,3]
["Rob Lowe","HRC","V40",1,7,null,null,null,null,4]
["Mark Spiller","BS","S",1,8,null,null,null,4]
["Danny Beazley","BS","V40",1,9,null,null,null,null,5]
["Tim Cheshire","BS","S",1,10,null,null,null,5]
["Craig Dyce","SS","V50",2,11,null,null,null,null,null,1]
["Steve Wilkes","BS","V40",1,12,null,null,null,null,6]
["Alex Smith","SS","S",2,13,null,null,null,6]
["Martin Westley","HRC","S",1,14,null,null,null,7]
["Tom Porter","WJ","S",1,15,null,null,null,8]
["Matthew Ironside","BS","S",1,16,null,null,null,9]
["Paul Reddaway","WJ","V50",1,17,null,null,null,null,null,2]
["Keir Mann","BS","S",1,18,null,null,null,10]
["Neil Bull","WJ","V40",1,19,null,null,null,null,7]
["Mark Cyl","WJ","V40",1,20,null,null,null,null,8]
["Simon Ellice","BS","V40",1,21,null,null,null,11]
["Martin Green","SS","V40",1,22,null,null,null,null,9]
["David Raimondo","SS","S",1,23,null,null,null,12]
["Matt McRandal","BS","S",1,24,null,null,null,13]
["Ben Russell-Smith","WJ","S",1,25,null,null,null,14]
["Matt Billis","SS","V40",1,26,null,null,null,null,10]
["Adam Watson","WJ","S",1,27,null,null,null,15]
["Gavin Long","SS","V50",1,28,null,null,null,null,null,3]
["Kevin Mully","BS","V40",1,29,null,null,null,null,11]
["Jason Hasty","BS","V40",1,30,null,null,null,null,12]
["Matt Brown","WJ","S",1,31,null,null,null,16]
["Martin Coulter","HRC","S",1,32,null,null,null,17]
["Andrew Kavanagh","WJ","S",1,33,null,null,null,18]
["Daren Barnes","SS","S",1,34,null,null,null,19]
["James McHattie","SS","S",2,35,null,null,null,20]
["Andy Terrell","HRC","V40",1,36,null,null,null,null,13]
["Colin Baker","HRC","V40",1,37,null,null,null,null,14]
["Lee Webber","HRC","V40",1,38,null,null,null,null,15]
["Tim Tait","SS","V40",1,39,null,null,null,null,16]
["Alan Broughton","HRC","V50",1,40,null,null,null,null,null,4]
["Ollie Wyatt","BS","S",1,41,null,null,null,21]
["Jack Whitelegg","WJ","V40",1,42,null,null,null,null,17]
["Ollie Last","BS","V50",1,43,null,null,null,null,null,5]
["Nick D'Alton","HRC","V40",1,44,null,null,null,null,18]
["Dave Cody","BS","V40",1,45,null,null,null,null,19]
["Tim McMahon","SS","V40",1,46,null,null,null,null,20]
["Alan Jones","SS","V50",1,47,null,null,null,null,null,6]
["Barry Taylor","SS","V40",1,48,null,null,null,null,21]
["Matt Coaker","BS","S",1,49,null,null,null,22]
["Richard Eddishaw","BS","V50",1,50,null,null,null,null,null,7]
["Mark Sanz","WJ","V50",1,51,null,null,null,null,null,8]
["Paul Schroder","HRC","S",1,52,null,null,null,23]
["Robin Watson","BS","v40",1,53,null,null,null,null,22]
["Gary Jones","BS","V40",1,54,null,null,null,null,23]
["Mark Thackstone","SS","V40",1,55,null,null,null,null,24]
["John Hair","WJ","V40",1,56,null,null,null,null,25]
["John Appleby","BS","V40",1,57,null,null,null,null,26]
["Marco Arcidiacono","SS","V40",1,58,null,null,null,null,27]
["Lee Gamble","SS","V40",1,59,null,null,null,null,28]
["Dominic Mason","BS","V50",1,60,null,null,null,null,null,9]
["Toby Lumsden","SS","V60",1,61,null,null,null,null,null,null,1]
["Josh Shelton","HRC","S",1,62,null,null,null,24]
["Neil Halls","SS","V40",1,63,null,null,null,null,29]
["Nick Kenyon-Muir","WJ","V40",1,64,null,null,null,null,30]
["Tony Bacon","SS","S",2,65,null,null,null,25]
["Chris Chew","BS","V50",1,66,null,null,null,null,null,10]
["Alan Taylor","WJ","V40",1,67,null,null,null,null,31]
["Joe Hall","SS","V50",1,68,null,null,null,null,null,11]
["Mark Coutts","SS","V40",1,69,null,null,null,null,32]
["Chris green","BS","V40",1,70,null,null,null,null,33]
["Mark Fitzhenry","SS","V50",1,71,null,null,null,null,null,12]
["Jon Bull","HRC","V50",1,72,null,null,null,null,null,13]
["Steve Warren","HRC","V50",1,73,null,null,null,null,null,14]
["Darren Tiley","HRC","V40",1,74,null,null,null,null,34]
["Ali Cooke","SS","V40",1,75,null,null,null,null,35]
["Liam Shiels","BS","V40",1,76,null,null,null,null,36]
["Graeme Loudain","SS","V60",1,77,null,null,null,null,null,null,2]
["Mark Palmer","BS","V40",1,78,null,null,null,null,37]
["Sean Flyn","HRC","V60",1,79,null,null,null,null,null,null,3]
["David Martin","SS","V40",1,80,null,null,null,null,38]
["Paul Brennan","WJ","V50",1,81,null,null,null,null,null,15]
["Paul Dearlove","BS","V50",1,82,null,null,null,null,null,16]
["Alan Cootes","HRC","V60",1,83,null,null,null,null,null,null,4]
["Jamie Jephcott","HRC","V40",1,84,null,null,null,null,39]
["Mark Witham","HRC","V40",1,85,null,null,null,null,40]
["John Tennant","HRC","V60",1,86,null,null,null,null,null,null,5]
["Craig Dodgen","BS","V50",1,87,null,null,null,null,null,17]
["Stuart Gibson","SS","V50",1,88,null,null,null,null,null,18]
["Andrew Sims","WJ","V50",1,89,null,null,null,null,null,19]
["Graham Saville","HRC","V60",1,90,null,null,null,null,null,null,6]
["Keith Savill","SS","V50",1,91,null,null,null,null,null,20]
["Pasquale Pellecchia","HRC","V60",1,92,null,null,null,null,null,null,7]
["Graham Statter","BS","V60",1,93,null,null,null,null,null,null,8]
["Richard Coffey","WJ","V50",1,94,null,null,null,null,null,21]
["Charlie Coutts","SS","S",1,95,null,null,null,26]
["Alan Rafferty","WJ","V60",1,96,null,null,null,null,null,null,9]
["Guy Tremaine","SS","V50",1,97,null,null,null,null,null,22]
["Martin McColgan","HRC","V60",1,98,null,null,null,null,null,null,10]
["James Hewlett","SS","V70",1,99,null,null,null,null,null,null,null,1]
["Iain Rogers","SS","V50",1,100,null,null,null,null,null,23]
["Martin Sillitto","WJ","V50",1,101,null,null,null,null,null,24]
["Mathew Crook","WJ","V40",1,102,null,null,null,null,41]
["David Tew","SS","V50",1,103,null,null,null,null,null,25]
["Paul Cocklin","WJ","V50",1,104,null,null,null,null,null,26]
["Robin Lozeau","HRC","V60",1,105,null,null,null,null,null,null,11]
["Lee Pickering","BS","V50",1,106,null,null,null,null,null,27]
["Rob Shaw","SS","V60",1,107,null,null,null,null,null,null,12]
["Howard Roden","WJ","V40",1,108,null,null,null,null,42]
["Simon Joyce","WJ","V50",1,109,null,null,null,null,null,28]
["???? ????",null,null,null,110]
["Bill Brunton","HRC","V60",1,111,null,null,null,null,null,null,13]
["Roger Pantridge","WJ","V50",1,112,null,null,null,null,null,29]
["Mike Bradley","SS","V50",1,113,null,null,null,null,null,30]
["Alan Wellbelove","HRC","V50",1,114,null,null,null,null,null,31]
["Nick Cheal","WJ","V60",1,115,null,null,null,null,null,null,14]
["Rob Waddingham","WJ","V60",1,116,null,null,null,null,null,null,15]
["Ant Kirby","BS","S",1,117,null,null,null,27]
["Colin Naman","WJ","V60",1,118,null,null,null,null,null,null,16]
["Terry Nichols","WJ","V70",1,119,null,null,null,null,null,null,null,2]
["Steve Johnson","WJ","V60",1,120,null,null,null,null,null,null,17]
["Ron Newton","HRC","V60",1,121,null,null,null,null,null,null,18]
["Lawrence Watson","WJ","V60",1,122,null,null,null,null,null,null,19]
["Steve Sanders","BS","V50",1,123,null,null,null,null,null,32]

{"sheet":"Runners","index":2,"n_rows":125,"n_cols":29,"rows_kept":125,"cut":false,"hidden":false,"merged":[]}
["Name","Club","Age Category","Claim","Position",null,"Ware Joggers",null,null,null,null,null,"Bishop's Stortford",null,null,null,null,null,"Harlow",null,null,null,null,null,"Saffron Striders"]
["Michael Waddington","WJ","S",1,1,null,"Name","Club","Age Category","Claim","Position",null,"Name","Club","Age Category","Claim","Position",null,"Name","Club","Age Category","Claim","Position",null,"Name","Club","Age Category","Claim","Position"]
["Michael Waddington","WJ","S",1,1,null,"Michael Waddington","WJ","S",1,1,null,"James Bosher","BS","S",1,5,null,"Rob Lowe","HRC","V40",1,7,null,"Andy Mynott","SS","V40",1,2]
["Andy Mynott","SS","V40",1,2,null,"Oscar Bell","WJ","S",1,3,null,"Mark Spiller","BS","S",1,8,null,"Martin Westley","HRC","S",1,14,null,"Craig Dyce","SS","V50",2,11]
["Oscar Bell","WJ","S",1,3,null,"Kevin Francis","WJ","V40",1,4,null,"Danny Beazley","BS","V40",1,9,null,"Martin Coulter","HRC","S",1,32,null,"Alex Smith","SS","S",2,13]
["Kevin Francis","WJ","V40",1,4,null,"Vincent Riviere","WJ","V40",1,6,null,"Tim Cheshire","BS","S",1,10,null,"Andy Terrell","HRC","V40",1,36,null,"Martin Green","SS","V40",1,22]
["James Bosher","BS","S",1,5,null,"Tom Porter","WJ","S",1,15,null,"Steve Wilkes","BS","V40",1,12,null,"Colin Baker","HRC","V40",1,37,null,"David Raimondo","SS","S",1,23]
["Vincent Riviere","WJ","V40",1,6,null,"Paul Reddaway","WJ","V50",1,17,null,"Matthew Ironside","BS","S",1,16,null,"Lee Webber","HRC","V40",1,38,null,"Matt Billis","SS","V40",1,26]
["Rob Lowe","HRC","V40",1,7,null,"Neil Bull","WJ","V40",1,19,null,"Keir Mann","BS","S",1,18,null,"Alan Broughton","HRC","V50",1,40,null,"Gavin Long","SS","V50",1,28]
["Mark Spiller","BS","S",1,8,null,"Mark Cyl","WJ","V40",1,20,null,"Simon Ellice","BS","V40",1,21,null,"Nick D'Alton","HRC","V40",1,44,null,"Daren Barnes","SS","S",1,34]
["Danny Beazley","BS","V40",1,9,null,"Ben Russell-Smith","WJ","S",1,25,null,"Matt McRandal","BS","S",1,24,null,"Paul Schroder","HRC","S",1,52,null,"James McHattie","SS","S",2,35]
["Tim Cheshire","BS","S",1,10,null,"Adam Watson","WJ","S",1,27,null,"Kevin Mully","BS","V40",1,29,null,"Josh Shelton","HRC","S",1,62,null,"Tim Tait","SS","V40",1,39]
["Craig Dyce","SS","V50",2,11,null,"Matt Brown","WJ","S",1,31,null,"Jason Hasty","BS","V40",1,30,null,"Jon Bull","HRC","V50",1,72,null,"Tim McMahon","SS","V40",1,46]
["Steve Wilkes","BS","V40",1,12,null,"Andrew Kavanagh","WJ","S",1,33,null,"Ollie Wyatt","BS","S",1,41,null,"Steve Warren","HRC","V50",1,73,null,"Alan Jones","SS","V50",1,47]
["Alex Smith","SS","S",2,13,null,"Jack Whitelegg","WJ","V40",1,42,null,"Ollie Last","BS","V50",1,43,null,"Darren Tiley","HRC","V40",1,74,null,"Barry Taylor","SS","V40",1,48]
["Martin Westley","HRC","S",1,14,null,"Mark Sanz","WJ","V50",1,51,null,"Dave Cody","BS","V40",1,45,null,"Sean Flyn","HRC","V60",1,79,null,"Mark Thackstone","SS","V40",1,55]
["Tom Porter","WJ","S",1,15,null,"John Hair","WJ","V40",1,56,null,"Matt Coaker","BS","S",1,49,null,"Alan Cootes","HRC","V60",1,83,null,"Marco Arcidiacono","SS","V40",1,58]
["Matthew Ironside","BS","S",1,16,null,"Nick Kenyon-Muir","WJ","V40",1,64,null,"Richard Eddishaw","BS","V50",1,50,null,"Jamie Jephcott","HRC","V40",1,84,null,"Lee Gamble","SS","V40",1,59]
["Paul Reddaway","WJ","V50",1,17,null,"Alan Taylor","WJ","V40",1,67,null,"Robin Watson","BS","v40",1,53,null,"Mark Witham","HRC","V40",1,85,null,"Toby Lumsden","SS","V60",1,61]
["Keir Mann","BS","S",1,18,null,"Paul Brennan","WJ","V50",1,81,null,"Gary Jones","BS","V40",1,54,null,"John Tennant","HRC","V60",1,86,null,"Neil Halls","SS","V40",1,63]
["Neil Bull","WJ","V40",1,19,null,"Andrew Sims","WJ","V50",1,89,null,"John Appleby","BS","V40",1,57,null,"Graham Saville","HRC","V60",1,90,null,"Tony Bacon","SS","S",2,65]
["Mark Cyl","WJ","V40",1,20,null,"Richard Coffey","WJ","V50",1,94,null,"Dominic Mason","BS","V50",1,60,null,"Pasquale Pellecchia","HRC","V60",1,92,null,"Joe Hall","SS","V50",1,68]
["Simon Ellice","BS","V40",1,21,null,"Alan Rafferty","WJ","V60",1,96,null,"Chris Chew","BS","V50",1,66,null,"Martin McColgan","HRC","V60",1,98,null,"Mark Coutts","SS","V40",1,69]
["Martin Green","SS","V40",1,22,null,"Martin Sillitto","WJ","V50",1,101,null,"Chris green","BS","V40",1,70,null,"Robin Lozeau","HRC","V60",1,105,null,"Mark Fitzhenry","SS","V50",1,71]
["David Raimondo","SS","S",1,23,null,"Mathew Crook","WJ","V40",1,102,null,"Liam Shiels","BS","V40",1,76,null,"Bill Brunton","HRC","V60",1,111,null,"Ali Cooke","SS","V40",1,75]
["Matt McRandal","BS","S",1,24,null,"Paul Cocklin","WJ","V50",1,104,null,"Mark Palmer","BS","V40",1,78,null,"Alan Wellbelove","HRC","V50",1,114,null,"Graeme Loudain","SS","V60",1,77]
["Ben Russell-Smith","WJ","S",1,25,null,"Howard Roden","WJ","V40",1,108,null,"Paul Dearlove","BS","V50",1,82,null,"Ron Newton","HRC","V60",1,121,null,"David Martin","SS","V40",1,80]
["Matt Billis","SS","V40",1,26,null,"Simon Joyce","WJ","V50",1,109,null,"Craig Dodgen","BS","V50",1,87,null,null,null,null,null,null,null,"Stuart Gibson","SS","V50",1,88]
["Adam Watson","WJ","S",1,27,null,"Roger Pantridge","WJ","V50",1,112,null,"Graham Statter","BS","V60",1,93,null,null,null,null,null,null,null,"Keith Savill","SS","V50",1,91]
["Gavin Long","SS","V50",1,28,null,"Nick Cheal","WJ","V60",1,115,null,"Lee Pickering","BS","V50",1,106,null,null,null,null,null,null,null,"Charlie Coutts","SS","S",1,95]
["Kevin Mully","BS","V40",1,29,null,"Rob Waddingham","WJ","V60",1,116,null,"Ant Kirby","BS","S",1,117,null,null,null,null,null,null,null,"Guy Tremaine","SS","V50",1,97]
["Jason Hasty","BS","V40",1,30,null,"Colin Naman","WJ","V60",1,118,null,"Steve Sanders","BS","V50",1,123,null,null,null,null,null,null,null,"James Hewlett","SS","V70",1,99]
["Matt Brown","WJ","S",1,31,null,"Terry Nichols","WJ","V70",1,119,null,null,null,null,null,null,null,null,null,null,null,null,null,"Iain Rogers","SS","V50",1,100]
["Martin Coulter","HRC","S",1,32,null,"Steve Johnson","WJ","V60",1,120,null,null,null,null,null,null,null,null,null,null,null,null,null,"David Tew","SS","V50",1,103]
["Andrew Kavanagh","WJ","S",1,33,null,"Lawrence Watson","WJ","V60",1,122,null,null,null,null,null,null,null,null,null,null,null,null,null,"Rob Shaw","SS","V60",1,107]
["Daren Barnes","SS","S",1,34,null,null,null,null,null,null,null,null,null,null,null,null,null,null,null,null,null,null,null,"Mike Bradley","SS","V50",1,113]
["James McHattie","SS","S",2,35]
["Andy Terrell","HRC","V40",1,36]
["Colin Baker","HRC","V40",1,37]
["Lee Webber","HRC","V40",1,38]
["Tim Tait","SS","V40",1,39]
["Alan Broughton","HRC","V50",1,40]
["Ollie Wyatt","BS","S",1,41]
["Jack Whitelegg","WJ","V40",1,42]
["Ollie Last","BS","V50",1,43]
["Nick D'Alton","HRC","V40",1,44]
["Dave Cody","BS","V40",1,45]
["Tim McMahon","SS","V40",1,46]
["Alan Jones","SS","V50",1,47]
["Barry Taylor","SS","V40",1,48]
["Matt Coaker","BS","S",1,49]
["Richard Eddishaw","BS","V50",1,50]
["Mark Sanz","WJ","V50",1,51]
["Paul Schroder","HRC","S",1,52]
["Robin Watson","BS","v40",1,53]
["Gary Jones","BS","V40",1,54]
["Mark Thackstone","SS","V40",1,55]
["John Hair","WJ","V40",1,56]
["John Appleby","BS","V40",1,57]
["Marco Arcidiacono","SS","V40",1,58]
["Lee Gamble","SS","V40",1,59]
["Dominic Mason","BS","V50",1,60]
["Toby Lumsden","SS","V60",1,61]
["Josh Shelton","HRC","S",1,62]
["Neil Halls","SS","V40",1,63]
["Nick Kenyon-Muir","WJ","V40",1,64]
["Tony Bacon","SS","S",2,65]
["Chris Chew","BS","V50",1,66]
["Alan Taylor","WJ","V40",1,67]
["Joe Hall","SS","V50",1,68]
["Mark Coutts","SS","V40",1,69]
["Chris green","BS","V40",1,70]
["Mark Fitzhenry","SS","V50",1,71]
["Jon Bull","HRC","V50",1,72]
["Steve Warren","HRC","V50",1,73]
["Darren Tiley","HRC","V40",1,74]
["Ali Cooke","SS","V40",1,75]
["Liam Shiels","BS","V40",1,76]
["Graeme Loudain","SS","V60",1,77]
["Mark Palmer","BS","V40",1,78]
["Sean Flyn","HRC","V60",1,79]
["David Martin","SS","V40",1,80]
["Paul Brennan","WJ","V50",1,81]
["Paul Dearlove","BS","V50",1,82]
["Alan Cootes","HRC","V60",1,83]
["Jamie Jephcott","HRC","V40",1,84]
["Mark Witham","HRC","V40",1,85]
["John Tennant","HRC","V60",1,86]
["Craig Dodgen","BS","V50",1,87]
["Stuart Gibson","SS","V50",1,88]
["Andrew Sims","WJ","V50",1,89]
["Graham Saville","HRC","V60",1,90]
["Keith Savill","SS","V50",1,91]
["Pasquale Pellecchia","HRC","V60",1,92]
["Graham Statter","BS","V60",1,93]
["Richard Coffey","WJ","V50",1,94]
["Charlie Coutts","SS","S",1,95]
["Alan Rafferty","WJ","V60",1,96]
["Guy Tremaine","SS","V50",1,97]
["Martin McColgan","HRC","V60",1,98]
["James Hewlett","SS","V70",1,99]
["Iain Rogers","SS","V50",1,100]
["Martin Sillitto","WJ","V50",1,101]
["Mathew Crook","WJ","V40",1,102]
["David Tew","SS","V50",1,103]
["Paul Cocklin","WJ","V50",1,104]
["Robin Lozeau","HRC","V60",1,105]
["Lee Pickering","BS","V50",1,106]
["Rob Shaw","SS","V60",1,107]
["Howard Roden","WJ","V40",1,108]
["Simon Joyce","WJ","V50",1,109]
["???? ????",null,null,null,110]
["Bill Brunton","HRC","V60",1,111]
["Roger Pantridge","WJ","V50",1,112]
["Mike Bradley","SS","V50",1,113]
["Alan Wellbelove","HRC","V50",1,114]
["Nick Cheal","WJ","V60",1,115]
["Rob Waddingham","WJ","V60",1,116]
["Ant Kirby","BS","S",1,117]
["Colin Naman","WJ","V60",1,118]
["Terry Nichols","WJ","V70",1,119]
["Steve Johnson","WJ","V60",1,120]
["Ron Newton","HRC","V60",1,121]
["Lawrence Watson","WJ","V60",1,122]
["Steve Sanders","BS","V50",1,123]

{"sheet":"Categories","index":3,"n_rows":44,"n_cols":34,"rows_kept":44,"cut":false,"hidden":false,"merged":[]}
["Senior",null,null,null,null,null,null,"Vet 40",null,null,null,null,null,null,"Vet 50",null,null,null,null,null,null,"Vet 60",null,null,null,null,null,null,"Vet 70"]
["Name","Club","Age Category","Claim","Overall Position","Category Position",null,"Name","Club","Age Category","Claim","Overall Position","Category Position",null,"Name","Club","Age Category","Claim","Overall Position","Category Position",null,"Name","Club","Age Category","Claim","Overall Position","Category Position",null,"Name","Club","Age Category","Claim","Overall Position","Category Position"]
["Michael Waddington","WJ","S",1,1,1,null,"Andy Mynott","SS","V40",1,2,1,null,"Craig Dyce","SS","V50",2,11,1,null,"Toby Lumsden","SS","V60",1,61,1,null,"James Hewlett","SS","V70",1,99,1]
["Michael Waddington","WJ","S",1,1,2,null,"Kevin Francis","WJ","V40",1,4,2,null,"Paul Reddaway","WJ","V50",1,17,2,null,"Graeme Loudain","SS","V60",1,77,2,null,"Terry Nichols","WJ","V70",1,119,2]
["Oscar Bell","WJ","S",1,3,3,null,"Vincent Riviere","WJ","V40",1,6,3,null,"Gavin Long","SS","V50",1,28,3,null,"Sean Flyn","HRC","V60",1,79,3]
["James Bosher","BS","S",1,5,4,null,"Rob Lowe","HRC","V40",1,7,4,null,"Alan Broughton","HRC","V50",1,40,4,null,"Alan Cootes","HRC","V60",1,83,4]
["Mark Spiller","BS","S",1,8,5,null,"Danny Beazley","BS","V40",1,9,5,null,"Ollie Last","BS","V50",1,43,5,null,"John Tennant","HRC","V60",1,86,5]
["Tim Cheshire","BS","S",1,10,6,null,"Steve Wilkes","BS","V40",1,12,6,null,"Alan Jones","SS","V50",1,47,6,null,"Graham Saville","HRC","V60",1,90,6]
["Alex Smith","SS","S",2,13,7,null,"Neil Bull","WJ","V40",1,19,7,null,"Richard Eddishaw","BS","V50",1,50,7,null,"Pasquale Pellecchia","HRC","V60",1,92,7]
["Martin Westley","HRC","S",1,14,8,null,"Mark Cyl","WJ","V40",1,20,8,null,"Mark Sanz","WJ","V50",1,51,8,null,"Graham Statter","BS","V60",1,93,8]
["Tom Porter","WJ","S",1,15,9,null,"Simon Ellice","BS","V40",1,21,9,null,"Dominic Mason","BS","V50",1,60,9,null,"Alan Rafferty","WJ","V60",1,96,9]
["Matthew Ironside","BS","S",1,16,10,null,"Martin Green","SS","V40",1,22,10,null,"Chris Chew","BS","V50",1,66,10,null,"Martin McColgan","HRC","V60",1,98,10]
["Keir Mann","BS","S",1,18,11,null,"Matt Billis","SS","V40",1,26,11,null,"Joe Hall","SS","V50",1,68,11,null,"Robin Lozeau","HRC","V60",1,105,11]
["David Raimondo","SS","S",1,23,12,null,"Kevin Mully","BS","V40",1,29,12,null,"Mark Fitzhenry","SS","V50",1,71,12,null,"Rob Shaw","SS","V60",1,107,12]
["Matt McRandal","BS","S",1,24,13,null,"Jason Hasty","BS","V40",1,30,13,null,"Jon Bull","HRC","V50",1,72,13,null,"Bill Brunton","HRC","V60",1,111,13]
["Ben Russell-Smith","WJ","S",1,25,14,null,"Andy Terrell","HRC","V40",1,36,14,null,"Steve Warren","HRC","V50",1,73,14,null,"Nick Cheal","WJ","V60",1,115,14]
["Adam Watson","WJ","S",1,27,15,null,"Colin Baker","HRC","V40",1,37,15,null,"Paul Brennan","WJ","V50",1,81,15,null,"Rob Waddingham","WJ","V60",1,116,15]
["Matt Brown","WJ","S",1,31,16,null,"Lee Webber","HRC","V40",1,38,16,null,"Paul Dearlove","BS","V50",1,82,16,null,"Colin Naman","WJ","V60",1,118,16]
["Martin Coulter","HRC","S",1,32,17,null,"Tim Tait","SS","V40",1,39,17,null,"Craig Dodgen","BS","V50",1,87,17,null,"Steve Johnson","WJ","V60",1,120,17]
["Andrew Kavanagh","WJ","S",1,33,18,null,"Jack Whitelegg","WJ","V40",1,42,18,null,"Stuart Gibson","SS","V50",1,88,18,null,"Ron Newton","HRC","V60",1,121,18]
["Daren Barnes","SS","S",1,34,19,null,"Nick D'Alton","HRC","V40",1,44,19,null,"Andrew Sims","WJ","V50",1,89,19,null,"Lawrence Watson","WJ","V60",1,122,19]
["James McHattie","SS","S",2,35,20,null,"Dave Cody","BS","V40",1,45,20,null,"Keith Savill","SS","V50",1,91,20]
["Ollie Wyatt","BS","S",1,41,21,null,"Tim McMahon","SS","V40",1,46,21,null,"Richard Coffey","WJ","V50",1,94,21]
["Matt Coaker","BS","S",1,49,22,null,"Barry Taylor","SS","V40",1,48,22,null,"Guy Tremaine","SS","V50",1,97,22]
["Paul Schroder","HRC","S",1,52,23,null,"Gary Jones","BS","V40",1,54,23,null,"Iain Rogers","SS","V50",1,100,23]
["Josh Shelton","HRC","S",1,62,24,null,"Mark Thackstone","SS","V40",1,55,24,null,"Martin Sillitto","WJ","V50",1,101,24]
["Tony Bacon","SS","S",2,65,25,null,"John Hair","WJ","V40",1,56,25,null,"David Tew","SS","V50",1,103,25]
["Charlie Coutts","SS","S",1,95,26,null,"John Appleby","BS","V40",1,57,26,null,"Paul Cocklin","WJ","V50",1,104,26]
["Ant Kirby","BS","S",1,117,27,null,"Marco Arcidiacono","SS","V40",1,58,27,null,"Lee Pickering","BS","V50",1,106,27]
["Ant Kirby","BS","S",1,117,28,null,"Lee Gamble","SS","V40",1,59,28,null,"Simon Joyce","WJ","V50",1,109,28]
[null,null,null,null,null,null,null,"Neil Halls","SS","V40",1,63,29,null,"Roger Pantridge","WJ","V50",1,112,29]
[null,null,null,null,null,null,null,"Nick Kenyon-Muir","WJ","V40",1,64,30,null,"Mike Bradley","SS","V50",1,113,30]
[null,null,null,null,null,null,null,"Alan Taylor","WJ","V40",1,67,31,null,"Alan Wellbelove","HRC","V50",1,114,31]
[null,null,null,null,null,null,null,"Mark Coutts","SS","V40",1,69,32,null,"Steve Sanders","BS","V50",1,123,32]
[null,null,null,null,null,null,null,"Chris green","BS","V40",1,70,33]
[null,null,null,null,null,null,null,"Darren Tiley","HRC","V40",1,74,34]
[null,null,null,null,null,null,null,"Ali Cooke","SS","V40",1,75,35]
[null,null,null,null,null,null,null,"Liam Shiels","BS","V40",1,76,36]
[null,null,null,null,null,null,null,"Mark Palmer","BS","V40",1,78,37]
[null,null,null,null,null,null,null,"David Martin","SS","V40",1,80,38]
[null,null,null,null,null,null,null,"Jamie Jephcott","HRC","V40",1,84,39]
[null,null,null,null,null,null,null,"Mark Witham","HRC","V40",1,85,40]
[null,null,null,null,null,null,null,"Mathew Crook","WJ","V40",1,102,41]
[null,null,null,null,null,null,null,"Howard Roden","WJ","V40",1,108,42]